Reaction Details
TargetEpidermal growth factor receptor
LigandBDBM4363
Substrate/Competitorn/a
Meas. Tech.ChEMBL_76720 (CHEMBL688553)
IC50 7000±n/a nM
Citation Thacher, SMVasudevan, JTsang, KYNagpal, SChandraratna, RA New dermatological agents for the treatment of psoriasis. J Med Chem44:281-97 (2001) Epidermal growth factor receptor
Name:Epidermal growth factor receptor
Type:Receptor Kinase Domain
Mol. Mass.:134279.59
Organism:Homo sapiens (Human)
Description:P00533
Residue:1210
BDBM4363
NameBDBM4363
Synonyms:(2E)-2-cyano-3-(3,4-dihydroxyphenyl)prop-2-enethioamide CHEMBL77030 T7540 (Tyrphostin 47) alpha-Cyano-(3,4-dihydroxy)thiocinnamide | benzylidenemalononitrile (BMN) deriv. 47
TypeSmall organic molecule
Emp. Form.C10H8N2O2S
Mol. Mass.220.248
SMILESNC(=S)C(=C\c1ccc(O)c(O)c1)\C#N