Reaction Details
TargetReverse transcriptase/RNaseH
LigandBDBM50102267
Substrate/Competitorn/a
Meas. Tech.ChEMBL_196185 (CHEMBL882853)
Ki 210±n/a nM
Citation Campiani, GAiello, FFabbrini, MMorelli, ERamunno, AArmaroli, SNacci, VGarofalo, AGreco, GNovellino, EMaga, GSpadari, SBergamini, AVentura, LBongiovanni, BCapozzi, MBolacchi, FMarini, SColetta, MGuiso, GCaccia, S Quinoxalinylethylpyridylthioureas (QXPTs) as potent non-nucleoside HIV-1 reverse transcriptase (RT) inhibitors. Further SAR studies and identification of a novel orally bioavailable hydrazine-based antiviral agent. J Med Chem44:305-15 (2001) Reverse transcriptase/RNaseH
Name:Reverse transcriptase/RNaseH
Type:PROTEIN
Mol. Mass.:65229.15
Organism:Human immunodeficiency virus 1
Description:ChEMBL_1473730
Residue:566
BDBM50102267
NameBDBM50102267
Synonyms:1-(5-Bromo-pyridin-2-yl)-3-[2-(7-chloro-pyrrolo[1,2-a]quinoxalin-4-yloxy)-ethyl]-thiourea | CHEMBL105976
TypeSmall organic molecule
Emp. Form.C19H15BrClN5OS
Mol. Mass.476.777
SMILESClc1ccc2c(c1)nc(OCCNC(=S)Nc1ccc(Br)cn1)c1cccn21