Reaction Details
TargetReverse transcriptase/RNaseH
LigandBDBM50102264
Substrate/Competitorn/a
Meas. Tech.ChEMBL_196190 (CHEMBL802994)
Ki 1800±n/a nM
Citation Campiani, GAiello, FFabbrini, MMorelli, ERamunno, AArmaroli, SNacci, VGarofalo, AGreco, GNovellino, EMaga, GSpadari, SBergamini, AVentura, LBongiovanni, BCapozzi, MBolacchi, FMarini, SColetta, MGuiso, GCaccia, S Quinoxalinylethylpyridylthioureas (QXPTs) as potent non-nucleoside HIV-1 reverse transcriptase (RT) inhibitors. Further SAR studies and identification of a novel orally bioavailable hydrazine-based antiviral agent. J Med Chem44:305-15 (2001) Reverse transcriptase/RNaseH
Name:Reverse transcriptase/RNaseH
Type:PROTEIN
Mol. Mass.:65229.15
Organism:Human immunodeficiency virus 1
Description:ChEMBL_1473730
Residue:566
BDBM50102264
NameBDBM50102264
Synonyms:CHEMBL322698 | Pyrazine-2-carboxylic acid N'-pyrrolo[1,2-a]quinoxalin-4-yl-hydrazide
TypeSmall organic molecule
Emp. Form.C16H12N6O
Mol. Mass.304.3061
SMILESO=C(NNc1nc2ccccc2n2cccc12)c1cnccn1