Reaction Details
TargetReverse transcriptase/RNaseH
LigandBDBM50102274
Substrate/Competitorn/a
Meas. Tech.ChEMBL_196191 (CHEMBL803636)
Ki 220±n/a nM
Citation Campiani, GAiello, FFabbrini, MMorelli, ERamunno, AArmaroli, SNacci, VGarofalo, AGreco, GNovellino, EMaga, GSpadari, SBergamini, AVentura, LBongiovanni, BCapozzi, MBolacchi, FMarini, SColetta, MGuiso, GCaccia, S Quinoxalinylethylpyridylthioureas (QXPTs) as potent non-nucleoside HIV-1 reverse transcriptase (RT) inhibitors. Further SAR studies and identification of a novel orally bioavailable hydrazine-based antiviral agent. J Med Chem44:305-15 (2001) Reverse transcriptase/RNaseH
Name:Reverse transcriptase/RNaseH
Type:PROTEIN
Mol. Mass.:65229.15
Organism:Human immunodeficiency virus 1
Description:ChEMBL_1473730
Residue:566
BDBM50102274
NameBDBM50102274
Synonyms:1-(5-Bromo-pyridin-2-yl)-3-[2-(7,8-dimethyl-pyrrolo[1,2-a]quinoxalin-4-yloxy)-ethyl]-thiourea | CHEMBL317406
TypeSmall organic molecule
Emp. Form.C21H20BrN5OS
Mol. Mass.470.385
SMILESCc1cc2nc(OCCNC(=S)Nc3ccc(Br)cn3)c3cccn3c2cc1C