Reaction Details
TargetReverse transcriptase/RNaseH
LigandBDBM50102270
Substrate/Competitorn/a
Meas. Tech.ChEMBL_196187 (CHEMBL801174)
Ki 60±n/a nM
Citation Campiani, GAiello, FFabbrini, MMorelli, ERamunno, AArmaroli, SNacci, VGarofalo, AGreco, GNovellino, EMaga, GSpadari, SBergamini, AVentura, LBongiovanni, BCapozzi, MBolacchi, FMarini, SColetta, MGuiso, GCaccia, S Quinoxalinylethylpyridylthioureas (QXPTs) as potent non-nucleoside HIV-1 reverse transcriptase (RT) inhibitors. Further SAR studies and identification of a novel orally bioavailable hydrazine-based antiviral agent. J Med Chem44:305-15 (2001) Reverse transcriptase/RNaseH
Name:Reverse transcriptase/RNaseH
Type:PROTEIN
Mol. Mass.:65229.15
Organism:Human immunodeficiency virus 1
Description:ChEMBL_1473730
Residue:566
BDBM50102270
NameBDBM50102270
Synonyms:1-(5-Bromo-pyridin-2-yl)-3-[2-(9-fluoro-4-oxo-4H-pyrrolo[1,2-a]quinoxalin-5-yl)-ethyl]-thiourea | CHEMBL107099
TypeSmall organic molecule
Emp. Form.C19H15BrFN5OS
Mol. Mass.460.323
SMILESFc1cccc2n(CCNC(=S)Nc3ccc(Br)cn3)c(=O)c3cccn3c12