Reaction Details
Target5-hydroxytryptamine receptor 2A
LigandBDBM50034203
Substrate/Competitorn/a
Meas. Tech.ChEMBL_2300 (CHEMBL617085)
Ki 9.6±n/a nM
Citation Rowley, MBristow, LJHutson, PH Current and novel approaches to the drug treatment of schizophrenia. J Med Chem44:477-501 (2001) 5-hydroxytryptamine receptor 2A
Name:5-hydroxytryptamine receptor 2A
Type:undefined
Mol. Mass.:52607.65
Organism:Homo sapiens (Human)
Description:P28223
Residue:471
BDBM50034203
NameBDBM50034203
Synonyms:(1-Phenethyl-piperidin-4-yl)-phenyl-methanone | CHEMBL19589
TypeSmall organic molecule
Emp. Form.C20H23NO
Mol. Mass.293.4027
SMILESO=C(C1CCN(CCc2ccccc2)CC1)c1ccccc1