Reaction Details
TargetD(4) dopamine receptor
LigandBDBM50095894
Substrate/Competitorn/a
Meas. Tech.ChEMBL_60684 (CHEMBL675946)
Ki 1.9±n/a nM
Citation Rowley, MBristow, LJHutson, PH Current and novel approaches to the drug treatment of schizophrenia. J Med Chem44:477-501 (2001) D(4) dopamine receptor
Name:D(4) dopamine receptor
Type:Enzyme
Mol. Mass.:48373.19
Organism:Homo sapiens (Human)
Description:P21917
Residue:419
BDBM50095894
NameBDBM50095894
Synonyms:3-(4-Phenyl-piperazin-1-ylmethyl)-1H-pyrrolo[2,3-b]pyridine | CHEMBL357182
TypeSmall organic molecule
Emp. Form.C18H20N4
Mol. Mass.292.3782
SMILESC(N1CCN(CC1)c1ccccc1)c1c[nH]c2ncccc12