Reaction Details
TargetD(4) dopamine receptor
LigandBDBM50050472
Substrate/Competitorn/a
Meas. Tech.ChEMBL_60684 (CHEMBL675946)
Ki 5.5±n/a nM
Citation Rowley, MBristow, LJHutson, PH Current and novel approaches to the drug treatment of schizophrenia. J Med Chem44:477-501 (2001) D(4) dopamine receptor
Name:D(4) dopamine receptor
Type:Enzyme
Mol. Mass.:48373.19
Organism:Homo sapiens (Human)
Description:P21917
Residue:419
BDBM50050472
NameBDBM50050472
Synonyms:4-[5-(4-Chloro-phenyl)-1H-pyrazol-3-yl]-1-phenethyl-piperidine CHEMBL6416
TypeSmall organic molecule
Emp. Form.C22H24ClN3
Mol. Mass.365.899
SMILESClc1ccc(cc1)-c1cc([nH]n1)C1CCN(CCc2ccccc2)CC1