Reaction Details
TargetD(4) dopamine receptor
LigandBDBM50095893
Substrate/Competitorn/a
Meas. Tech.ChEMBL_60684 (CHEMBL675946)
Ki 4.3±n/a nM
Citation Rowley, MBristow, LJHutson, PH Current and novel approaches to the drug treatment of schizophrenia. J Med Chem44:477-501 (2001) D(4) dopamine receptor
Name:D(4) dopamine receptor
Type:Enzyme
Mol. Mass.:48373.19
Organism:Homo sapiens (Human)
Description:P21917
Residue:419
BDBM50095893
NameBDBM50095893
Synonyms:3-{4-[2-(2-Chloro-phenyl)-ethyl]-piperazin-1-yl}-4,5-dihydro-1H-benzo[g]indazole | CHEMBL422314
TypeSmall organic molecule
Emp. Form.C23H25ClN4
Mol. Mass.392.924
SMILESClc1ccccc1CCN1CCN(CC1)c1[nH]nc-2c1CCc1ccccc-21