Reaction Details
TargetAdenosine receptor A1
LigandBDBM50369976
Substrate/Competitorn/a
Meas. Tech.ChEMBL_29318 (CHEMBL642306)
Ki 10.1±n/a nM
Citation Rieger, JMBrown, MLSullivan, GWLinden, JMacdonald, TL Design, synthesis, and evaluation of novel A2A adenosine receptor agonists. J Med Chem44:531-9 (2001) Adenosine receptor A1
Name:Adenosine receptor A1
Type:Protein
Mol. Mass.:36704.13
Organism:Rattus norvegicus (rat)
Description:n/a
Residue:326
BDBM50369976
NameBDBM50369976
Synonyms:CHEMBL608753
TypeSmall organic molecule
Emp. Form.C11H15N5O5
Mol. Mass.297.2673
SMILESNc1nc(CO)nc2n(cnc12)C1O[C@H](CO)[C@@H](O)[C@H]1O