Reaction Details
TargetAdenosine receptor A2a
LigandBDBM50208788
Substrate/Competitorn/a
Meas. Tech.ChEMBL_30008 (CHEMBL641299)
Ki 17±n/a nM
Citation Rieger, JMBrown, MLSullivan, GWLinden, JMacdonald, TL Design, synthesis, and evaluation of novel A2A adenosine receptor agonists. J Med Chem44:531-9 (2001) Adenosine receptor A2a
Name:Adenosine receptor A2a
Type:G Protein-Coupled Receptor (GPCR)
Mol. Mass.:45015.65
Organism:Rattus norvegicus (rat)
Description:Rat A2A receptors expressed in CHO cells.
Residue:410
BDBM50208788
NameBDBM50208788
Synonyms:(2R,3R,4S,5R)-2-(6-amino-2-phenethoxy-9H-purin-9-yl)-5-(hydroxymethyl)-tetrahydrofuran-3,4-diol | CHEMBL374685
TypeSmall organic molecule
Emp. Form.C18H21N5O5
Mol. Mass.387.3898
SMILESNc1nc(OCCc2ccccc2)nc2n(cnc12)[C@@H]1O[C@H](CO)[C@@H](O)[C@H]1O