Reaction Details
TargetAdenosine receptor A2a
LigandBDBM50369996
Substrate/Competitorn/a
Meas. Tech.ChEMBL_30008 (CHEMBL641299)
Ki 4.5±n/a nM
Citation Rieger, JMBrown, MLSullivan, GWLinden, JMacdonald, TL Design, synthesis, and evaluation of novel A2A adenosine receptor agonists. J Med Chem44:531-9 (2001) Adenosine receptor A2a
Name:Adenosine receptor A2a
Type:G Protein-Coupled Receptor (GPCR)
Mol. Mass.:45015.65
Organism:Rattus norvegicus (rat)
Description:Rat A2A receptors expressed in CHO cells.
Residue:410
BDBM50369996
NameBDBM50369996
Synonyms:CHEMBL611288
TypeSmall organic molecule
Emp. Form.C21H30N6O6
Mol. Mass.462.4995
SMILESCCNC(=O)[C@H]1OC([C@H](O)[C@@H]1O)n1cnc2c(N)nc(CC3CCC(CC3)C(=O)OC)nc12