Reaction Details
TargetAdenosine receptor A1
LigandBDBM50369997
Substrate/Competitorn/a
Meas. Tech.ChEMBL_29318 (CHEMBL642306)
Ki 1184±n/a nM
Citation Rieger, JMBrown, MLSullivan, GWLinden, JMacdonald, TL Design, synthesis, and evaluation of novel A2A adenosine receptor agonists. J Med Chem44:531-9 (2001) Adenosine receptor A1
Name:Adenosine receptor A1
Type:Protein
Mol. Mass.:36704.13
Organism:Rattus norvegicus (rat)
Description:n/a
Residue:326
BDBM50369997
NameBDBM50369997
Synonyms:CHEMBL611586
TypeSmall organic molecule
Emp. Form.C22H24FN7O4
Mol. Mass.469.4689
SMILESCCNC(=O)[C@H]1OC([C@H](O)[C@@H]1O)n1cnc2c(N)nc(nc12)C#CNCCc1ccc(F)cc1