Reaction Details
TargetMacrophage migration inhibitory factor
LigandBDBM50095996
Substrate/Competitorn/a
Meas. Tech.ChEMBL_103899 (CHEMBL711481)
Ki 5800±n/a nM
Citation Orita, MYamamoto, SKatayama, NAoki, MTakayama, KYamagiwa, YSeki, NSuzuki, HKurihara, HSakashita, HTakeuchi, MFujita, SYamada, TTanaka, A Coumarin and chromen-4-one analogues as tautomerase inhibitors of macrophage migration inhibitory factor: discovery and X-ray crystallography. J Med Chem44:540-7 (2001) Macrophage migration inhibitory factor
Name:Macrophage migration inhibitory factor
Type:Enzyme
Mol. Mass.:12478.18
Organism:Homo sapiens (Human)
Description:P14174
Residue:115
BDBM50095996
NameBDBM50095996
Synonyms:3-(7-Hydroxy-2-oxo-2H-chromen-3-yl)-3-oxo-propionic acid ethyl ester | CHEMBL153406
TypeSmall organic molecule
Emp. Form.C14H12O6
Mol. Mass.276.2415
SMILESCCOC(=O)CC(=O)c1cc2ccc(O)cc2oc1=O