Reaction Details
TargetMacrophage migration inhibitory factor
LigandBDBM50096004
Substrate/Competitorn/a
Meas. Tech.ChEMBL_103899 (CHEMBL711481)
Ki 280±n/a nM
Citation Orita, MYamamoto, SKatayama, NAoki, MTakayama, KYamagiwa, YSeki, NSuzuki, HKurihara, HSakashita, HTakeuchi, MFujita, SYamada, TTanaka, A Coumarin and chromen-4-one analogues as tautomerase inhibitors of macrophage migration inhibitory factor: discovery and X-ray crystallography. J Med Chem44:540-7 (2001) Macrophage migration inhibitory factor
Name:Macrophage migration inhibitory factor
Type:Enzyme
Mol. Mass.:12478.18
Organism:Homo sapiens (Human)
Description:P14174
Residue:115
BDBM50096004
NameBDBM50096004
Synonyms:7-Hydroxy-3-[4-(2-oxo-2H-chromen-3-yl)-thiazol-2-yl]-chromen-2-one | CHEMBL153074
TypeSmall organic molecule
Emp. Form.C21H11NO5S
Mol. Mass.389.381
SMILESOc1ccc2cc(-c3nc(cs3)-c3cc4ccccc4oc3=O)c(=O)oc2c1