Reaction Details
TargetUrokinase-type plasminogen activator
LigandBDBM12657
Substrate/Competitorn/a
Meas. Tech.ChEMBL_212982 (CHEMBL817003)
Ki>19000±n/a nM
Citation Pinto, DJOrwat, MJWang, SFevig, JMQuan, MLAmparo, ECacciola, JRossi, KAAlexander, RSSmallwood, AMLuettgen, JMLiang, LAungst, BJWright, MRKnabb, RMWong, PCWexler, RRLam, PY Discovery of 1-[3-(aminomethyl)phenyl]-N-3-fluoro-2'-(methylsulfonyl)-[1,1'-biphenyl]-4-yl]-3-(trifluoromethyl)-1H-pyrazole-5-carboxamide (DPC423), a highly potent, selective, and orally bioavailable inhibitor of blood coagulation factor Xa. J Med Chem44:566-78 (2001) Urokinase-type plasminogen activator
Name:Urokinase-type plasminogen activator
Type:Enzyme
Mol. Mass.:48528.62
Organism:Homo sapiens (Human)
Description:P00749
Residue:431
BDBM12657
NameBDBM12657
Synonyms:1-[3-(Aminomethyl)phenyl]-N-[3-fluoro-2-(methylsulfonyl)-[1,1-biphenyl]-4-yl]-3-(trifluoromethyl)-1H-pyrazole-5-carboxamide CHEMBL559015 DPC423
TypeSmall organic molecule
Emp. Form.C25H20F4N4O3S
Mol. Mass.532.51
SMILESCS(=O)(=O)c1ccccc1-c1ccc(NC(=O)c2cc(nn2-c2cccc(CN)c2)C(F)(F)F)c(F)c1