Reaction Details
TargetProthrombin
LigandBDBM50087533
Substrate/Competitorn/a
Meas. Tech.ChEMBL_208358 (CHEMBL813668)
Ki 2800±n/a nM
Citation Pinto, DJOrwat, MJWang, SFevig, JMQuan, MLAmparo, ECacciola, JRossi, KAAlexander, RSSmallwood, AMLuettgen, JMLiang, LAungst, BJWright, MRKnabb, RMWong, PCWexler, RRLam, PY Discovery of 1-[3-(aminomethyl)phenyl]-N-3-fluoro-2'-(methylsulfonyl)-[1,1'-biphenyl]-4-yl]-3-(trifluoromethyl)-1H-pyrazole-5-carboxamide (DPC423), a highly potent, selective, and orally bioavailable inhibitor of blood coagulation factor Xa. J Med Chem44:566-78 (2001) Prothrombin
Name:Prothrombin
Type:Protein
Mol. Mass.:70029.57
Organism:Homo sapiens (Human)
Description:P00734
Residue:622
BDBM50087533
NameBDBM50087533
Synonyms:3-(3-Carbamimidoyl-phenyl)-isoxazole-4-carboxylic acid (2'-sulfamoyl-biphenyl-4-yl)-amide CHEMBL153611
TypeSmall organic molecule
Emp. Form.C23H19N5O4S
Mol. Mass.461.493
SMILESNC(=N)c1cccc(c1)-c1nocc1C(=O)Nc1ccc(cc1)-c1ccccc1S(N)(=O)=O