Reaction Details
TargetAdenosine receptor A2a
LigandBDBM50067081
Substrate/Competitorn/a
Meas. Tech.ChEMBL_30024 (CHEMBL641315)
Ki 3.3±n/a nM
Citation van Muijlwijk-Koezen, JETimmerman, HVollinga, RCFrijtag von Drabbe Künzel, Jde Groote, MVisser, SIJzerman, AP Thiazole and thiadiazole analogues as a novel class of adenosine receptor antagonists. J Med Chem44:749-62 (2001) Adenosine receptor A2a
Name:Adenosine receptor A2a
Type:G Protein-Coupled Receptor (GPCR)
Mol. Mass.:45015.65
Organism:Rattus norvegicus (rat)
Description:Rat A2A receptors expressed in CHO cells.
Residue:410
BDBM50067081
NameBDBM50067081
Synonyms:9-Fluoro-2-furan-2-yl-5,6-dihydro-[1,2,4]triazolo[1,5-c]quinazolin-5-ylamine CGS-15943 | CHEMBL70605
TypeSmall organic molecule
Emp. Form.C13H8FN5O
Mol. Mass.269.2339
SMILESNc1nc2ccc(F)cc2c2nc(nn12)-c1ccco1