Reaction Details
TargetAdenosine receptor A3
LigandBDBM50088475
Substrate/Competitorn/a
Meas. Tech.ChEMBL_32009 (CHEMBL646606)
Ki 4±n/a nM
Citation van Muijlwijk-Koezen, JETimmerman, HVollinga, RCFrijtag von Drabbe Künzel, Jde Groote, MVisser, SIJzerman, AP Thiazole and thiadiazole analogues as a novel class of adenosine receptor antagonists. J Med Chem44:749-62 (2001) Adenosine receptor A3
Name:Adenosine receptor A3
Type:G Protein-Coupled Receptor (GPCR)
Mol. Mass.:36197.32
Organism:Homo sapiens (Human)
Description:P0DMS8
Residue:318
BDBM50088475
NameBDBM50088475
Synonyms:1-(2-Methoxy-phenyl)-3-(2-pyridin-3-yl-quinazolin-4-yl)-urea VUF-5574
TypeSmall organic molecule
Emp. Form.C21H17N5O2
Mol. Mass.371.392
SMILESCOc1ccccc1NC(=O)Nc1nc(nc2ccccc12)-c1cccnc1