Reaction Details
TargetProthrombin
LigandBDBM50098236
Substrate/Competitorn/a
Meas. Tech.ChEMBL_210587 (CHEMBL817553)
Ki 1.5±n/a nM
Citation Pierce, ACJorgensen, WL Estimation of binding affinities for selective thrombin inhibitors via Monte Carlo simulations. J Med Chem44:1043-50 (2001) Prothrombin
Name:Prothrombin
Type:Enzyme
Mol. Mass.:70502.73
Organism:Bos taurus (Bovine)
Description:P00735
Residue:625
BDBM50098236
NameBDBM50098236
Synonyms:CHEMBL9415 | Naphthalene-2-sulfonic acid {1-[4-(amino-hydrazino-methyl)-benzyl]-2-azepan-1-yl-2-oxo-ethyl}-amide
TypeSmall organic molecule
Emp. Form.C26H33N5O3S
Mol. Mass.495.637
SMILESNNC(N)c1ccc(C[C@H](NS(=O)(=O)c2ccc3ccccc3c2)C(=O)N2CCCCCC2)cc1