Reaction Details
TargetNeutrophil elastase
LigandBDBM50098820
Substrate/Competitorn/a
Meas. Tech.ChEMBL_63965 (CHEMBL677434)
Ki 114±n/a nM
Citation Ohmoto, KYamamoto, TOkuma, MHoriuchi, TImanishi, HOdagaki, YKawabata, KSekioka, THirota, YMatsuoka, SNakai, HToda, MCheronis, JCSpruce, LWGyorkos, AWieczorek, M Development of orally active nonpeptidic inhibitors of human neutrophil elastase. J Med Chem44:1268-85 (2001) Neutrophil elastase
Name:Neutrophil elastase
Type:Enzyme
Mol. Mass.:28532.38
Organism:Homo sapiens (Human)
Description:P08246
Residue:267
BDBM50098820
NameBDBM50098820
Synonyms:2-[1-(5-tert-Butyl-[1,3,4]oxadiazole-2-carbonyl)-2-methyl-propylcarbamoyl]-2,3-dihydro-indole-1-carboxylic acid isopropyl ester | CHEMBL23100
TypeSmall organic molecule
Emp. Form.C24H32N4O5
Mol. Mass.456.5347
SMILESCC(C)OC(=O)N1[C@@H](Cc2ccccc12)C(=O)N[C@@H](C(C)C)C(=O)c1nnc(o1)C(C)(C)C