Reaction Details
TargetNeutrophil elastase
LigandBDBM50098829
Substrate/Competitorn/a
Meas. Tech.ChEMBL_63965 (CHEMBL677434)
Ki 836±n/a nM
Citation Ohmoto, KYamamoto, TOkuma, MHoriuchi, TImanishi, HOdagaki, YKawabata, KSekioka, THirota, YMatsuoka, SNakai, HToda, MCheronis, JCSpruce, LWGyorkos, AWieczorek, M Development of orally active nonpeptidic inhibitors of human neutrophil elastase. J Med Chem44:1268-85 (2001) Neutrophil elastase
Name:Neutrophil elastase
Type:Enzyme
Mol. Mass.:28532.38
Organism:Homo sapiens (Human)
Description:P08246
Residue:267
BDBM50098829
NameBDBM50098829
Synonyms:CHEMBL23643 | N-[1-(5-tert-Butyl-[1,3,4]oxadiazole-2-carbonyl)-2-methyl-propyl]-2-(4-isopropyl-2,5-dioxo-imidazolidin-1-yl)-acetamide
TypeSmall organic molecule
Emp. Form.C19H29N5O5
Mol. Mass.407.4641
SMILESCC(C)[C@H](NC(=O)Cn1c(O)c([nH]c1=O)C(C)C)C(=O)c1nnc(o1)C(C)(C)C