Reaction Details
TargetNeutrophil elastase
LigandBDBM50098830
Substrate/Competitorn/a
Meas. Tech.ChEMBL_63965 (CHEMBL677434)
Ki 5.1±n/a nM
Citation Ohmoto, KYamamoto, TOkuma, MHoriuchi, TImanishi, HOdagaki, YKawabata, KSekioka, THirota, YMatsuoka, SNakai, HToda, MCheronis, JCSpruce, LWGyorkos, AWieczorek, M Development of orally active nonpeptidic inhibitors of human neutrophil elastase. J Med Chem44:1268-85 (2001) Neutrophil elastase
Name:Neutrophil elastase
Type:Enzyme
Mol. Mass.:28532.38
Organism:Homo sapiens (Human)
Description:P08246
Residue:267
BDBM50098830
NameBDBM50098830
Synonyms:1-{3-Methyl-2-[(pyridine-3-carbonyl)-amino]-butyryl}-2,3-dihydro-1H-indole-2-carboxylic acid [1-(5-tert-butyl-[1,3,4]oxadiazole-2-carbonyl)-2-methyl-propyl]-amide | CHEMBL23104
TypeSmall organic molecule
Emp. Form.C31H38N6O5
Mol. Mass.574.6706
SMILESCC(C)[C@H](NC(=O)c1cccnc1)C(=O)N1[C@@H](Cc2ccccc12)C(=O)N[C@@H](C(C)C)C(=O)c1nnc(o1)C(C)(C)C