Reaction Details
TargetNeutrophil elastase
LigandBDBM50098837
Substrate/Competitorn/a
Meas. Tech.ChEMBL_63965 (CHEMBL677434)
Ki 309±n/a nM
Citation Ohmoto, KYamamoto, TOkuma, MHoriuchi, TImanishi, HOdagaki, YKawabata, KSekioka, THirota, YMatsuoka, SNakai, HToda, MCheronis, JCSpruce, LWGyorkos, AWieczorek, M Development of orally active nonpeptidic inhibitors of human neutrophil elastase. J Med Chem44:1268-85 (2001) Neutrophil elastase
Name:Neutrophil elastase
Type:Enzyme
Mol. Mass.:28532.38
Organism:Homo sapiens (Human)
Description:P08246
Residue:267
BDBM50098837
NameBDBM50098837
Synonyms:2-(3H-Imidazole-4-carbonyl)-1,2,3,4-tetrahydro-isoquinoline-3-carboxylic acid [1-(5-tert-butyl-[1,3,4]oxadiazole-2-carbonyl)-2-methyl-propyl]-amide; hydrochloride | CHEMBL556386
TypeSmall organic molecule
Emp. Form.C25H30N6O4
Mol. Mass.478.5435
SMILESCC(C)[C@H](NC(=O)C1Cc2ccccc2CN1C(=O)c1cnc[nH]1)C(=O)c1nnc(o1)C(C)(C)C