Reaction Details
TargetChymotrypsinogen A
LigandBDBM50098862
Substrate/Competitorn/a
Meas. Tech.ChEMBL_49621 (CHEMBL660459)
Ki 32.6±n/a nM
Citation Akahoshi, FAshimori, ASakashita, HYoshimura, TImada, TNakajima, MMitsutomi, NKuwahara, SOhtsuka, TFukaya, CMiyazaki, MNakamura, N Synthesis, structure-activity relationships, and pharmacokinetic profiles of nonpeptidic alpha-keto heterocycles as novel inhibitors of human chymase. J Med Chem44:1286-96 (2001) Chymotrypsinogen A
Name:Chymotrypsinogen A
Type:Serine protease
Mol. Mass.:25670.88
Organism:Bos taurus (bovine)
Description:n/a
Residue:245
BDBM50098862
NameBDBM50098862
Synonyms:2-(2-{2-[5-Amino-2-(4-fluoro-phenyl)-6-oxo-6H-pyrimidin-1-yl]-acetylamino}-3-phenyl-propionyl)-benzooxazole-5-carboxylic acid ethylamide | CHEMBL25776
TypeSmall organic molecule
Emp. Form.C31H27FN6O5
Mol. Mass.582.5817
SMILESCCNC(=O)c1ccc2oc(nc2c1)C(=O)C(Cc1ccccc1)NC(=O)Cn1c(ncc(N)c1=O)-c1ccc(F)cc1