Reaction Details
TargetChymase
LigandBDBM50098891
Substrate/Competitorn/a
Meas. Tech.ChEMBL_197662 (CHEMBL807472)
Ki 16.9±n/a nM
Citation Akahoshi, FAshimori, ASakashita, HYoshimura, TEda, MImada, TNakajima, MMitsutomi, NKuwahara, SOhtsuka, TFukaya, CMiyazaki, MNakamura, N Synthesis, structure-activity relationships, and pharmacokinetic profiles of nonpeptidic difluoromethylene ketones as novel inhibitors of human chymase. J Med Chem44:1297-304 (2001) Chymase
Name:Chymase
Type:Enzyme
Mol. Mass.:27340.12
Organism:Homo sapiens (Human)
Description:n/a
Residue:247
BDBM50098891
NameBDBM50098891
Synonyms:4-[2-(5-Amino-6-oxo-2-m-tolyl-6H-pyrimidin-1-yl)-acetylamino]-2,2-difluoro-3-oxo-5-phenyl-pentanoic acid benzylamide | CHEMBL25833
TypeSmall organic molecule
Emp. Form.C31H29F2N5O4
Mol. Mass.573.5899
SMILESCc1cccc(c1)-c1ncc(N)c(=O)n1CC(=O)NC(Cc1ccccc1)C(=O)C(F)(F)C(=O)NCc1ccccc1