Reaction Details
TargetChymase
LigandBDBM50098874
Substrate/Competitorn/a
Meas. Tech.ChEMBL_197666 (CHEMBL807475)
Ki 4240±n/a nM
Citation Akahoshi, FAshimori, ASakashita, HYoshimura, TEda, MImada, TNakajima, MMitsutomi, NKuwahara, SOhtsuka, TFukaya, CMiyazaki, MNakamura, N Synthesis, structure-activity relationships, and pharmacokinetic profiles of nonpeptidic difluoromethylene ketones as novel inhibitors of human chymase. J Med Chem44:1297-304 (2001) Chymase
Name:Chymase
Type:PROTEIN
Mol. Mass.:27587.00
Organism:Rattus norvegicus
Description:ChEMBL_197666
Residue:247
BDBM50098874
NameBDBM50098874
Synonyms:4-{2-[5-Amino-2-(3-chloro-phenyl)-6-oxo-6H-pyrimidin-1-yl]-acetylamino}-2,2-difluoro-3-oxo-5-phenyl-pentanoic acid benzylamide | CHEMBL24734
TypeSmall organic molecule
Emp. Form.C30H26ClF2N5O4
Mol. Mass.594.008
SMILESNc1cnc(-c2cccc(Cl)c2)n(CC(=O)NC(Cc2ccccc2)C(=O)C(F)(F)C(=O)NCc2ccccc2)c1=O