Reaction Details
TargetSomatostatin receptor type 2
LigandBDBM50370053
Substrate/Competitorn/a
Meas. Tech.ChEMBL_200679 (CHEMBL807091)
Ki 5.45±n/a nM
Citation Rajeswaran, WGHocart, SJMurphy, WATaylor, JECoy, DH Highly potent and subtype selective ligands derived by N-methyl scan of a somatostatin antagonist. J Med Chem44:1305-11 (2001) Somatostatin receptor type 2
Name:Somatostatin receptor type 2
Type:Enzyme
Mol. Mass.:41344.94
Organism:Homo sapiens (Human)
Description:P30874
Residue:369
BDBM50370053
NameBDBM50370053
Synonyms:CHEMBL1793861
TypeSmall organic molecule
Emp. Form.C56H68ClN13O9S2
Mol. Mass.1166.804
SMILESC[C@H](O)[C@H]1NC(=O)[C@H](CCCCN)N(C)C(=O)[C@@H](Cc2c[nH]c3ccccc23)NC(=O)[C@H](Cc2cccnc2)NC(=O)[C@H](CSSC[C@@H](NC1=O)C(=O)NC(Cc1c[nH]c2ccccc12)C(N)=O)NC(=O)C(N)Cc1ccc(Cl)cc1