Reaction Details
TargetDelta-type opioid receptor
LigandBDBM50370067
Substrate/Competitorn/a
Meas. Tech.ChEMBL_146322 (CHEMBL757531)
Ki 0.22±n/a nM
Citation McLamore, SUllrich, TRothman, RBXu, HDersch, CCoop, ADavis, PPorreca, FJacobson, AERice, KC Effect of N-alkyl and N-alkenyl substituents in noroxymorphindole, 17-substituted-6,7-dehydro-4,5alpha-epoxy-3,14-dihydroxy-6,7:2',3'-indolomorphinans, on opioid receptor affinity, selectivity, and efficacy. J Med Chem44:1471-4 (2001) Delta-type opioid receptor
Name:Delta-type opioid receptor
Type:Enzyme Catalytic Domain
Mol. Mass.:40577.25
Organism:MOUSE
Description:P32300
Residue:372
BDBM50370067
NameBDBM50370067
Synonyms:CHEMBL1237164
TypeSmall organic molecule
Emp. Form.C26H26N2O3
Mol. Mass.414.4962
SMILESOc1ccc2C[C@H]3N(CC4CC4)CC[C@@]45[C@@H](Oc1c24)c1[nH]c2ccccc2c1C[C@@]35O