Reaction Details
TargetDelta-type opioid receptor
LigandBDBM50221416
Substrate/Competitorn/a
Meas. Tech.ChEMBL_146322 (CHEMBL757531)
Ki 0.8±n/a nM
Citation McLamore, SUllrich, TRothman, RBXu, HDersch, CCoop, ADavis, PPorreca, FJacobson, AERice, KC Effect of N-alkyl and N-alkenyl substituents in noroxymorphindole, 17-substituted-6,7-dehydro-4,5alpha-epoxy-3,14-dihydroxy-6,7:2',3'-indolomorphinans, on opioid receptor affinity, selectivity, and efficacy. J Med Chem44:1471-4 (2001) Delta-type opioid receptor
Name:Delta-type opioid receptor
Type:Enzyme Catalytic Domain
Mol. Mass.:40577.25
Organism:MOUSE
Description:P32300
Residue:372
BDBM50221416
NameBDBM50221416
Synonyms:22-methyl-(2S,13R)-14-oxa-11,22-diazaheptacyclo[13.9.1.01,13.02,21.04,12.05,10.019,25]pentacosa-4(12),5(10),6,8,15(25),16,18-heptaene-2,16-diol(HCl0.5H2O) (Oxymorphindole, OMI) CHEMBL401093 | OXYMORPHINDOLE
TypeSmall organic molecule
Emp. Form.C23H22N2O3
Mol. Mass.374.4324
SMILESCN1CC[C@@]23[C@H]4Oc5c2c(C[C@@H]1[C@]3(O)Cc1c4[nH]c2ccccc12)ccc5O