Reaction Details
TargetP2Y purinoceptor 1
LigandBDBM50076460
Substrate/Competitorn/a
Meas. Tech.ChEMBL_147721 (CHEMBL759191)
IC50 206±n/a nM
Citation Kim, HSRavi, RGMarquez, VEMaddileti, SWihlborg, AKErlinge, DMalmsjö, MBoyer, JLHarden, TKJacobson, KA Methanocarba modification of uracil and adenine nucleotides: high potency of Northern ring conformation at P2Y1, P2Y2, P2Y4, and P2Y11 but not P2Y6 receptors. J Med Chem45:208-18 (2001) P2Y purinoceptor 1
Name:P2Y purinoceptor 1
Type:Enzyme
Mol. Mass.:42090.25
Organism:Homo sapiens (Human)
Description:P47900
Residue:373
BDBM50076460
NameBDBM50076460
Synonyms:CHEMBL288798 | Phosphoric acid mono-[5-(2-chloro-6-methylamino-purin-9-yl)-2-phosphonooxymethyl-tetrahydro-furan-3-yl] ester
TypeSmall organic molecule
Emp. Form.C11H16ClN5O9P2
Mol. Mass.459.673
SMILESCNc1nc(Cl)nc2n(cnc12)C1CC(OP(O)(O)=O)C(COP(O)(O)=O)O1