Reaction Details
TargetP2Y purinoceptor 1
LigandBDBM50118238
Substrate/Competitorn/a
Meas. Tech.ChEMBL_147721 (CHEMBL759191)
IC50 52±n/a nM
Citation Kim, HSRavi, RGMarquez, VEMaddileti, SWihlborg, AKErlinge, DMalmsjö, MBoyer, JLHarden, TKJacobson, KA Methanocarba modification of uracil and adenine nucleotides: high potency of Northern ring conformation at P2Y1, P2Y2, P2Y4, and P2Y11 but not P2Y6 receptors. J Med Chem45:208-18 (2001) P2Y purinoceptor 1
Name:P2Y purinoceptor 1
Type:Enzyme
Mol. Mass.:42090.25
Organism:Homo sapiens (Human)
Description:P47900
Residue:373
BDBM50118238
NameBDBM50118238
Synonyms:CHEMBL339873 | MRS 2279
TypeSmall organic molecule
Emp. Form.C13H18ClN5O8P2
Mol. Mass.469.711
SMILESCNc1nc(Cl)nc2n(cnc12)[C@H]1CC(OP(O)(O)=O)C2(COP(O)(O)=O)CC12