Reaction Details
TargetP2Y purinoceptor 1
LigandBDBM18137
Substrate/Competitorn/a
Meas. Tech.ChEMBL_162518 (CHEMBL766764)
EC50 3500±n/a nM
Citation Kim, HSRavi, RGMarquez, VEMaddileti, SWihlborg, AKErlinge, DMalmsjö, MBoyer, JLHarden, TKJacobson, KA Methanocarba modification of uracil and adenine nucleotides: high potency of Northern ring conformation at P2Y1, P2Y2, P2Y4, and P2Y11 but not P2Y6 receptors. J Med Chem45:208-18 (2001) P2Y purinoceptor 1
Name:P2Y purinoceptor 1
Type:n/a
Mol. Mass.:41199.64
Organism:Meleagris gallopavo
Description:n/a
Residue:362
BDBM18137
NameBDBM18137
Synonyms:AMP US11185100, TABLE 7.3 adenosine 5 -monophosphate | {[(2R,3S,4R,5R)-5-(6-amino-9H-purin-9-yl)-3,4-dihydroxyoxolan-2-yl]methoxy}phosphonic acid
TypeNucleoside or nucleotide
Emp. Form.C10H14N5O7P
Mol. Mass.347.2212
SMILESNc1ncnc2n(cnc12)[C@@H]1O[C@H](COP(O)(O)=O)[C@@H](O)[C@H]1O