Reaction Details
TargetRicin
LigandBDBM50028122
Substrate/Competitorn/a
Meas. Tech.ChEMBL_63579 (CHEMBL677513)
IC50 2800000±n/a nM
Citation Miller, DJRavikumar, KShen, HSuh, JKKerwin, SMRobertus, JD Structure-based design and characterization of novel platforms for ricin and shiga toxin inhibition. J Med Chem45:90-8 (2001) Ricin
Name:Ricin
Synonyms:RICI_RICCO
Type:PROTEIN
Mol. Mass.:64090.82
Organism:Ricinus communis
Description:ChEMBL_1286970
Residue:576
BDBM50028122
NameBDBM50028122
TypeSmall organic molecule
Emp. Form.C6H6N4O
Mol. Mass.150.138
SMILESNc1nc2[nH]ccc2c(=O)[nH]1