Reaction Details
TargetP2Y purinoceptor 1
LigandBDBM50118232
Substrate/Competitorn/a
Meas. Tech.ChEMBL_162517 (CHEMBL766763)
EC50 8.0±n/a nM
Citation Ravi, RGKim, HSServos, JZimmermann, HLee, KMaddileti, SBoyer, JLHarden, TKJacobson, KA Adenine nucleotide analogues locked in a Northern methanocarba conformation: enhanced stability and potency as P2Y(1) receptor agonists. J Med Chem45:2090-100 (2002) P2Y purinoceptor 1
Name:P2Y purinoceptor 1
Type:n/a
Mol. Mass.:41199.64
Organism:Meleagris gallopavo
Description:n/a
Residue:362
BDBM50118232
NameBDBM50118232
Synonyms:2-MeSATP CHEMBL336208
TypeSmall organic molecule
Emp. Form.C11H18N5O13P3S
Mol. Mass.553.273
SMILESCSc1nc(N)c2ncn([C@@H]3O[C@H](COP(O)(=O)OP(O)(=O)OP(O)(O)=O)[C@@H](O)[C@H]3O)c2n1