Reaction Details
TargetInosine-5'-monophosphate dehydrogenase 2
LigandBDBM50113219
Substrate/Competitorn/a
Meas. Tech.ChEMBL_89812 (CHEMBL697550)
IC50 11±n/a nM
Citation Dhar, TGShen, ZGuo, JLiu, CWatterson, SHGu, HHPitts, WJFleener, CARouleau, KASherbina, NZMcIntyre, KWShuster, DJWitmer, MRTredup, JAChen, BCZhao, RBednarz, MSCheney, DLMacMaster, JFMiller, LMBerry, KKHarper, TWBarrish, JCHollenbaugh, DLIwanowicz, EJ Discovery of N-[2-[2-[[3-methoxy-4-(5-oxazolyl)phenyl]amino]-5-oxazolyl]phenyl]-N-methyl-4- morpholineacetamide as a novel and potent inhibitor of inosine monophosphate dehydrogenase with excellent in vivo activity. J Med Chem45:2127-30 (2002) Inosine-5'-monophosphate dehydrogenase 2
Name:Inosine-5'-monophosphate dehydrogenase 2
Type:Enzyme
Mol. Mass.:55806.87
Organism:Homo sapiens (Human)
Description:Recombinant IMPDH2 expressed in E. coli.
Residue:514
BDBM50113219
NameBDBM50113219
Synonyms:CHEMBL68075 | N-{2-[2-(3-Methoxy-4-oxazol-5-yl-phenylamino)-oxazol-5-yl]-phenyl}-N-methyl-2-pyrazol-1-yl-acetamide
TypeSmall organic molecule
Emp. Form.C25H22N6O4
Mol. Mass.470.48
SMILESCOc1cc(Nc2ncc(o2)-c2ccccc2N(C)C(=O)Cn2cccn2)ccc1-c1cnco1