Reaction Details
TargetB2 bradykinin receptor
LigandBDBM50113263
Substrate/Competitorn/a
Meas. Tech.ChEMBL_40444 (CHEMBL652383)
Ki 0.6±n/a nM
Citation Dziadulewicz, EKRitchie, TJHallett, ASnell, CRDavies, JWWrigglesworth, RDunstan, ARBloomfield, GCDrake, GSMcIntyre, PBrown, MCBurgess, GMLee, WDavis, CYaqoob, MPhagoo, SBPhillips, EPerkins, MNCampbell, EADavis, AJRang, HP Nonpeptide bradykinin B2 receptor antagonists: conversion of rodent-selective bradyzide analogues into potent, orally-active human bradykinin B2 receptor antagonists. J Med Chem45:2160-72 (2002) B2 bradykinin receptor
Name:B2 bradykinin receptor
Type:Enzyme Catalytic Domain
Mol. Mass.:44941.22
Organism:RAT
Description:B2 BRADYKININ BDKRB2 RAT::P25023
Residue:396
BDBM50113263
NameBDBM50113263
Synonyms:(S)-1-[4-(4-benzhydrylthiosemicarbazido)-3-nitrobenzenesulfonyl]pyrrolidine-2-carboxylic acid{2-[(2-dimethylaminoethyl)methylamino]ethyl}amide(bradyzide) CHEMBL431562
TypeSmall organic molecule
Emp. Form.C32H42N8O5S2
Mol. Mass.682.856
SMILESCN(C)CCN(C)CCNC(=O)C1CCCN1S(=O)(=O)c1ccc(N[N-]C(=[SH+])NC(c2ccccc2)c2ccccc2)c(c1)[N+]([O-])=O