Reaction Details
TargetTyrosine-protein phosphatase non-receptor type 1
LigandBDBM50113295
Substrate/Competitorn/a
Meas. Tech.ChEMBL_162252 (CHEMBL770119)
IC50 12000±n/a nM
Citation Doman, TNMcGovern, SLWitherbee, BJKasten, TPKurumbail, RStallings, WCConnolly, DTShoichet, BK Molecular docking and high-throughput screening for novel inhibitors of protein tyrosine phosphatase-1B. J Med Chem45:2213-21 (2002) Tyrosine-protein phosphatase non-receptor type 1
Name:Tyrosine-protein phosphatase non-receptor type 1
Type:Protein phosphatase
Mol. Mass.:49963.76
Organism:Homo sapiens (Human)
Description:Human recombinant GST-fusion PTP1B (1-435).
Residue:435
BDBM50113295
NameBDBM50113295
Synonyms:1-[5-(4-Chloro-phenyl)-2-phenyl-2H-pyrazol-3-yl]-3-phenyl-urea | CHEMBL72757
TypeSmall organic molecule
Emp. Form.C22H17ClN4O
Mol. Mass.388.85
SMILESClc1ccc(cc1)-c1cc(NC(=O)Nc2ccccc2)n(n1)-c1ccccc1