Reaction Details
TargetTyrosine-protein phosphatase non-receptor type 1
LigandBDBM50113298
Substrate/Competitorn/a
Meas. Tech.ChEMBL_162252 (CHEMBL770119)
IC50 63900±n/a nM
Citation Doman, TNMcGovern, SLWitherbee, BJKasten, TPKurumbail, RStallings, WCConnolly, DTShoichet, BK Molecular docking and high-throughput screening for novel inhibitors of protein tyrosine phosphatase-1B. J Med Chem45:2213-21 (2002) Tyrosine-protein phosphatase non-receptor type 1
Name:Tyrosine-protein phosphatase non-receptor type 1
Type:Protein phosphatase
Mol. Mass.:49963.76
Organism:Homo sapiens (Human)
Description:Human recombinant GST-fusion PTP1B (1-435).
Residue:435
BDBM50113298
NameBDBM50113298
Synonyms:3,4-Dichloro-N-[4-(4-chloro-benzenesulfonyl)-5-methylsulfanyl-2H-pyrazol-3-yl]-benzamide | CHEMBL304307
TypeSmall organic molecule
Emp. Form.C17H12Cl3N3O3S2
Mol. Mass.476.784
SMILESCSc1n[nH]c(NC(=O)c2ccc(Cl)c(Cl)c2)c1S(=O)(=O)c1ccc(Cl)cc1