Reaction Details
TargetProgesterone receptor
LigandBDBM50113778
Substrate/Competitorn/a
Meas. Tech.ChEMBL_159546 (CHEMBL765662)
Ki>10000±n/a nM
Citation Morgan, BPSwick, AGHargrove, DMLaFlamme, JAMoynihan, MSCarroll, RSMartin, KALee, EDecosta, DBordner, J Discovery of potent, nonsteroidal, and highly selective glucocorticoid receptor antagonists. J Med Chem45:2417-24 (2002) Progesterone receptor
Name:Progesterone receptor
Type:Protein
Mol. Mass.:98979.52
Organism:Homo sapiens (Human)
Description:P06401
Residue:933
BDBM50113778
NameBDBM50113778
Synonyms:(S)-4a-Benzyl-7-methoxy-4,4a,9,10-tetrahydro-3H-phenanthren-2-one | CHEMBL82307
TypeSmall organic molecule
Emp. Form.C22H22O2
Mol. Mass.318.4089
SMILESCOc1ccc2c(CCC3=CC(=O)CC[C@]23Cc2ccccc2)c1