Reaction Details
TargetAndrogen receptor
LigandBDBM50113780
Substrate/Competitorn/a
Meas. Tech.ChEMBL_36271 (CHEMBL648838)
Ki 650±n/a nM
Citation Morgan, BPSwick, AGHargrove, DMLaFlamme, JAMoynihan, MSCarroll, RSMartin, KALee, EDecosta, DBordner, J Discovery of potent, nonsteroidal, and highly selective glucocorticoid receptor antagonists. J Med Chem45:2417-24 (2002) Androgen receptor
Name:Androgen receptor
Type:Receptor
Mol. Mass.:99185.27
Organism:Homo sapiens (Human)
Description:CHO cells were stably transfected with human AR gene.
Residue:920
BDBM50113780
NameBDBM50113780
Synonyms:(2R,4aS,10aR)-4a-benzyl-2-(prop-1-ynyl)-1,2,3,4,4a,9,10,10a-octahydrophenanthrene-2,7-diol CHEMBL78625 | CP-409069
TypeSmall organic molecule
Emp. Form.C24H26O2
Mol. Mass.346.462
SMILESCC#C[C@@]1(O)CC[C@]2(Cc3ccccc3)[C@H](CCc3cc(O)ccc23)C1