Reaction Details
TargetEstrogen receptor beta
LigandBDBM50113782
Substrate/Competitorn/a
Meas. Tech.ChEMBL_65279 (CHEMBL676603)
Ki>10000±n/a nM
Citation Morgan, BPSwick, AGHargrove, DMLaFlamme, JAMoynihan, MSCarroll, RSMartin, KALee, EDecosta, DBordner, J Discovery of potent, nonsteroidal, and highly selective glucocorticoid receptor antagonists. J Med Chem45:2417-24 (2002) Estrogen receptor beta
Name:Estrogen receptor beta
Type:Protein
Mol. Mass.:59238.43
Organism:Homo sapiens (Human)
Description:Q92731
Residue:530
BDBM50113782
NameBDBM50113782
Synonyms:(10R,13S,17S)-17-hydroxy-13-methyl-10-(4-methylbenzyl)-17-(prop-1-ynyl)-6,7,8,10,12,13,14,15,16,17-decahydro-1H-cyclopenta[a]phenanthren-3(2H)-one CHEMBL78704 | RU-43044
TypeSmall organic molecule
Emp. Form.C29H34O2
Mol. Mass.414.5791
SMILESCC#C[C@]1(O)CCC2C3CCC4=CC(=O)CC[C@]4(Cc4ccc(C)cc4)C3=CC[C@]12C