Reaction Details
TargetAndrogen receptor
LigandBDBM50113777
Substrate/Competitorn/a
Meas. Tech.ChEMBL_36270 (CHEMBL648837)
Ki 1300±n/a nM
Citation Morgan, BPSwick, AGHargrove, DMLaFlamme, JAMoynihan, MSCarroll, RSMartin, KALee, EDecosta, DBordner, J Discovery of potent, nonsteroidal, and highly selective glucocorticoid receptor antagonists. J Med Chem45:2417-24 (2002) Androgen receptor
Name:Androgen receptor
Type:Receptor
Mol. Mass.:99185.27
Organism:Homo sapiens (Human)
Description:CHO cells were stably transfected with human AR gene.
Residue:920
BDBM50113777
NameBDBM50113777
Synonyms:(4aS,10aR)-4a-benzyl-7-hydroxy-3,4,4a,9,10,10a-hexahydrophenanthren-2(1H)-one CHEMBL310180
TypeSmall organic molecule
Emp. Form.C21H22O2
Mol. Mass.306.3982
SMILESOc1ccc2c(CC[C@@H]3CC(=O)CC[C@@]23Cc2ccccc2)c1