Reaction Details
TargetProthrombin
LigandBDBM50113843
Substrate/Competitorn/a
Meas. Tech.ChEMBL_208348 (CHEMBL813658)
Ki 9000±n/a nM
Citation Cozzini, PFornabaio, MMarabotti, AAbraham, DJKellogg, GEMozzarelli, A Simple, intuitive calculations of free energy of binding for protein-ligand complexes. 1. Models without explicit constrained water. J Med Chem45:2469-83 (2002) Prothrombin
Name:Prothrombin
Type:Protein
Mol. Mass.:70029.57
Organism:Homo sapiens (Human)
Description:P00734
Residue:622
BDBM50113843
NameBDBM50113843
Synonyms:2-[4-(2-Pyrrolidin-1-yl-ethoxy)-phenyl]-3-[6-(2-pyrrolidin-1-yl-ethoxy)-pyridin-3-ylmethyl]-benzo[b]thiophen-6-ol | CHEMBL81887
TypeSmall organic molecule
Emp. Form.C32H37N3O3S
Mol. Mass.543.719
SMILESOc1ccc2c(Cc3ccc(OCCN4CCCC4)nc3)c(sc2c1)-c1ccc(OCCN2CCCC2)cc1