Reaction Details
TargetFatty acid-binding protein, adipocyte
LigandBDBM50250904
Substrate/Competitorn/a
Meas. Tech.ChEMBL_29917 (CHEMBL641280)
Kd 58000±n/a nM
Citation Cozzini, PFornabaio, MMarabotti, AAbraham, DJKellogg, GEMozzarelli, A Simple, intuitive calculations of free energy of binding for protein-ligand complexes. 1. Models without explicit constrained water. J Med Chem45:2469-83 (2002) Fatty acid-binding protein, adipocyte
Name:Fatty acid-binding protein, adipocyte
Type:Enzyme
Mol. Mass.:14719.23
Organism:Homo sapiens (Human)
Description:P15090
Residue:132
BDBM50250904
NameBDBM50250904
Synonyms:CHEMBL460657 elaidic acid | trans-Delta(9)-octadecenoic acid
TypeSmall organic molecule
Emp. Form.C18H34O2
Mol. Mass.282.4614
SMILESCCCCCCCC\C=C\CCCCCCCC(O)=O