Reaction Details
TargetProthrombin
LigandBDBM50113854
Substrate/Competitorn/a
Meas. Tech.ChEMBL_210588 (CHEMBL817554)
Ki 1300±n/a nM
Citation Cozzini, PFornabaio, MMarabotti, AAbraham, DJKellogg, GEMozzarelli, A Simple, intuitive calculations of free energy of binding for protein-ligand complexes. 1. Models without explicit constrained water. J Med Chem45:2469-83 (2002) Prothrombin
Name:Prothrombin
Type:Enzyme
Mol. Mass.:70502.73
Organism:Bos taurus (Bovine)
Description:P00735
Residue:625
BDBM50113854
NameBDBM50113854
Synonyms:4-[3-Oxo-3-piperidin-1-yl-2-(toluene-4-sulfonylamino)-propyl]-benzamidine
TypeSmall organic molecule
Emp. Form.C22H29N4O3S
Mol. Mass.429.555
SMILESCc1ccc(cc1)S(=O)(=O)NC(Cc1ccc(cc1)C(N)=[NH2+])C(=O)N1CCCCC1