Reaction Details
TargetCoagulation factor X
LigandBDBM50113913
Substrate/Competitorn/a
Meas. Tech.ChEMBL_49312 (CHEMBL663411)
Ki 3±n/a nM
Citation Phillips, GGuilford, WJBuckman, BODavey, DDEagen, KAKoovakkat, SLiang, AMcCarrick, MMohan, RNg, HPPinkerton, MSubramanyam, BHo, ETrinh, LWhitlow, MWu, SXu, WMorrissey, MM Design, synthesis, and activity of a novel series of factor Xa inhibitors: optimization of arylamidine groups. J Med Chem45:2484-93 (2002) Coagulation factor X
Name:Coagulation factor X
Type:Enzyme
Mol. Mass.:54726.60
Organism:Homo sapiens (Human)
Description:n/a
Residue:488
BDBM50113913
NameBDBM50113913
Synonyms:3-[6-(3-Dimethylamino-phenoxy)-3,5-difluoro-4-methyl-pyridin-2-yloxy]-4-hydroxy-benzamidine | CHEMBL82925
TypeSmall organic molecule
Emp. Form.C21H20F2N4O3
Mol. Mass.414.4053
SMILESCN(C)c1cccc(Oc2nc(Oc3cc(ccc3O)C(N)=N)c(F)c(C)c2F)c1