Reaction Details
TargetOxytocin receptor
LigandBDBM50370115
Substrate/Competitorn/a
Meas. Tech.ChEMBL_149044 (CHEMBL762237)
Ki 0.34±n/a nM
Citation Terrillon, SCheng, LLStoev, SMouillac, BBarberis, CManning, MDurroux, T Synthesis and characterization of fluorescent antagonists and agonists for human oxytocin and vasopressin V(1)(a) receptors. J Med Chem45:2579-88 (2002) Oxytocin receptor
Name:Oxytocin receptor
Type:Enzyme Catalytic Domain
Mol. Mass.:42793.26
Organism:Homo sapiens (Human)
Description:Oxytocin OXTR HEK293::B2R9L7
Residue:389
BDBM50370115
NameBDBM50370115
Synonyms:CHEMBL1790717
TypeSmall organic molecule
Emp. Form.C62H74N12O18S2
Mol. Mass.1339.451
SMILESCC[C@@H](C)[C@H]1NC(=O)[C@@H](NC(=O)C(O)CSSC[C@@H](NC(=O)[C@@H](CC(N)=O)NC(=O)[C@@H](CCC(N)=O)NC1=O)C(=O)N1CCC[C@@H]1C(=O)N[C@@H](CCCCNC(=O)c1ccc2C(=O)OC3(c2c1)c1ccc(O)cc1Oc1cc(O)ccc31)C(=O)NCN)c1ccc(O)cc1