Reaction Details
TargetMelanocortin receptor 5
LigandBDBM50114088
Substrate/Competitorn/a
Meas. Tech.ChEMBL_106653 (CHEMBL712998)
Ki<1±n/a nM
CommentsZero 01/04/2022
Citation Kavarana, MJTrivedi, DCai, MYing, JHammer, MCabello, CGrieco, PHan, GHruby, VJ Novel cyclic templates of alpha-MSH give highly selective and potent antagonists/agonists for human melanocortin-3/4 receptors. J Med Chem45:2644-50 (2002) Melanocortin receptor 5
Name:Melanocortin receptor 5
Type:Enzyme
Mol. Mass.:36612.92
Organism:Homo sapiens (Human)
Description:P33032
Residue:325
BDBM50114088
NameBDBM50114088
Synonyms:9-Benzyl-6-(3-guanidino-propyl)-3-(1H-indol-3-ylmethyl)-12-methyl-2,5,8,11,14,17-hexaoxo-1,4,7,10,13,18hexaaza-cyclotricosane-23-carboxylic acid amide | CHEMBL436903
TypeSmall organic molecule
Emp. Form.C39H53N11O7
Mol. Mass.787.9076
SMILESC[C@@H]1NC(=O)CCC(=O)NCCCC[C@@H](NC(=O)[C@@H](Cc2c[nH]c3ccccc23)NC(=O)[C@H](CCCNC(N)=N)NC(=O)[C@@H](Cc2ccccc2)NC1=O)C(N)=O