Reaction Details
TargetMelanocortin receptor 3
LigandBDBM50114081
Substrate/Competitorn/a
Meas. Tech.ChEMBL_106832 (CHEMBL717673)
Ki 390±n/a nM
Citation Kavarana, MJTrivedi, DCai, MYing, JHammer, MCabello, CGrieco, PHan, GHruby, VJ Novel cyclic templates of alpha-MSH give highly selective and potent antagonists/agonists for human melanocortin-3/4 receptors. J Med Chem45:2644-50 (2002) Melanocortin receptor 3
Name:Melanocortin receptor 3
Type:Enzyme
Mol. Mass.:36044.86
Organism:Homo sapiens (Human)
Description:P41968
Residue:323
BDBM50114081
NameBDBM50114081
Synonyms:22-Benzyl-19-(3-guanidino-propyl)-16-(1H-indol-3-ylmethyl)-4,7,15,18,21,24-hexaoxo-docosahydro-3a,8,14,17,20,23-hexaaza-cyclopentacyclotricosene-13-carboxylic acid amide | MK-10
TypeSmall organic molecule
Emp. Form.C41H55N11O7
Mol. Mass.813.9449
SMILESNC(=N)NCCC[C@H]1NC(=O)[C@H](Cc2ccccc2)NC(=O)C2CCCN2C(=O)CCC(=O)NCCCC[C@H](NC(=O)[C@H](Cc2c[nH]c3ccccc23)NC1=O)C(N)=O